{"text_format":"1","workbook":"xlsx","n_sheets":10,"sheets":["Instructions","LCFV TCO Dashboard","Sensitivity","Summary","Currency","Capital Cost","Operational Cost","Financing","TCO_1","Plots"],"not_rendered":{"charts":12,"images":10,"macros":0,"external_links":1,"defined_names":0,"comments":0,"pivot_tables":0},"unopened":[],"bounds":{"document_bytes":16777216,"sheet_cells":100000,"rows_first":2000,"rows_last":500,"rows_between":2000,"halvings":0,"cell_chars":16384,"cell_head_chars":4096},"cells_cut":0,"cells_raw":0,"read":"whole","date_system":"1900"}

{"sheet":"Instructions","index":0,"n_rows":43,"n_cols":6,"rows_kept":43,"cut":false,"hidden":false,"merged":[[35,1,35,3],[35,5,35,13],[22,1,22,13],[33,1,33,3],[33,5,33,13],[34,1,34,3],[34,5,34,13],[23,1,23,3],[23,5,23,13],[30,1,30,3],[30,5,30,13],[31,1,31,3],[31,5,31,13],[32,5,32,13],[27,1,27,3],[27,5,27,13],[11,1,11,3],[1,1,1,13],[3,1,3,13],[26,5,26,13],[29,5,29,13],[12,1,12,3],[11,5,13,13],[15,5,15,13],[16,5,16,13],[17,5,17,13],[20,1,20,3],[20,5,20,13],[21,1,21,3],[21,5,21,13],[5,1,5,8],[14,1,14,13],[15,1,15,3],[16,1,16,3],[9,1,9,3],[10,1,10,3],[9,5,9,13],[8,5,8,13],[10,5,10,13],[8,1,8,3],[42,1,43,14],[29,1,29,3],[17,1,17,3],[18,1,18,3],[24,1,24,3],[25,1,25,3],[26,1,26,3],[18,5,18,13],[24,5,24,13],[25,5,25,13],[36,5,36,13],[32,1,32,3],[36,1,36,3],[28,1,28,13],[19,1,19,3],[19,5,19,13]]}
[]
[null,"HOW TO USE THE DYNAMIC TOTAL COST OF OWNERSHIP DASHBOARD"]
[]
[null,"All cells highlighted Green are Input cells. Values can only be edited in these cells to observe the dynamic changes in the dashboard on the right."]
[]
[null,"All cells highlighted Gray are Fixed cells. These values cannot be edited."]
[]
[]
[null,"CELL NAME",null,null,"FUNCTION","ACTION REQUIRED"]
[null,"Vehicle Holding Period (Year)",null,null,"Editable","Use the drop down menu on Cell C5 to choose the Vehicle holding period from 1 to 10 years "]
[null,"Daily Distance Travelled (km)",null,null,"Editable","Use the arrows on the right to increase/decrease to input Daily Distance Travelled in km"]
[null,"Daily Distance Travelled (mi)",null,null,"Fixed"]
[null,"Annual Distance Travelled (km)",null,null,"Fixed"]
[null,"Annual Distance Travelled (mi)",null,null,"Fixed"]
[null,"`"]
{"$rows_left_out":29}
{"sheet":"LCFV TCO Dashboard","index":1,"n_rows":81,"n_cols":48,"rows_kept":81,"cut":false,"hidden":false,"merged":[[2,1,2,3],[14,3,14,5],[16,2,16,5],[4,3,4,5]]}
[null,null,null,null,null,null,null,null,null,null,null,null,null,null,null,null,null,null,null,null,null,null,null,null,null,null,null,null,null,null,null,null,null,null,null,null,"10 YEAR","TCO",null,null,null,null,null,"DYNAMIC","TCO"]
[null,null,null,null,null,null,null,null,null,null,null,null,null,null,null,null,null,null,null,null,null,null,null,null,null,null,null,null,null,null,null,null,null,null,null,null,"e-LCFV",{"$f":"TCO_1!C11","v":8.5410743139367113},null,null,null,null,null,"e-LCFV",{"$f":"VLOOKUP($C$5,$AR$10:$AV$20,2,0)","v":11.609480535366913}]
[null,null,null,null,null,null,null,null,null,null,null,null,null,null,null,null,null,null,null,null,null,null,null,null,null,null,null,null,null,null,null,null,null,null,null,null,"Petrol - LCFV",{"$f":"TCO_1!D11","v":11.118342928162228},null,null,null,null,null,"Petrol - LCFV",{"$f":"VLOOKUP($C$5,$AR$10:$AV$20,3,0)","v":14.455542157174751}]
[null,null,null,null,null,null,null,null,null,null,null,null,null,null,null,null,null,null,null,null,null,null,null,null,null,null,null,null,null,null,null,null,null,null,null,null,"Diesel - LCFV",{"$f":"TCO_1!E11","v":11.758091164048205},null,null,null,null,null,"Diesel - LCFV",{"$f":"VLOOKUP($C$5,$AR$10:$AV$20,4,0)","v":15.38730001800676}]
[null,"Vehicle Holding Period (Year)",5,"              Use Drop down to choose Holding Period",null,null,null,null,null,null,null,null,null,null,null,null,null,null,null,null,null,null,null,null,null,null,null,null,null,null,null,null,null,null,null,null,"CNG - LCFV",{"$f":"TCO_1!F11","v":8.9597579707730706},null,null,null,null,null,"CNG - LCFV",{"$f":"VLOOKUP($C$5,$AR$10:$AV$20,5,0)","v":11.992457466837006}]
[]
[null,"Daily Distance Travelled (km)",150,null,"(Use Arrows to input Distance)"]
[null,"Daily Distance Travelled (mi)",{"$f":"C7*0.621371","v":93.205650000000006}]
[]
[null,"Annual Distance Travelled (km)",{"$f":"C7*315","v":47250},null,null,null,null,null,null,null,null,null,null,null,null,null,null,null,null,null,null,null,null,null,null,null,null,null,null,null,null,null,null,null,null,null,"Operational Years","e-LCFV","Petrol - LCFV","Diesel - LCFV","CNG - LCFV",null,null,null,"e-LCFV","Petrol - LCFV","Diesel - LCFV","CNG - LCFV"]
[null,"Annual Distance Travelled (mi)",{"$f":"C8*315","v":29359.779750000002},null,null,null,null,null,null,null,null,null,null,null,null,null,null,null,null,null,null,null,null,null,null,null,null,null,null,null,null,null,null,null,null,null,"Year 1",{"$f":"TCO_1!C31","v":28.305628175136643},{"$f":"TCO_1!C34","v":26.869927174703534},{"$f":"TCO_1!C37","v":29.829734097471391},{"$f":"TCO_1!C40","v":26.508602111682933},null,null,1,{"$f":"IF($C$5=AR11,AL11:AO11,)","v":0}]
[null,null,null,null,null,null,null,null,null,null,null,null,null,null,null,null,null,null,null,null,null,null,null,null,null,null,null,null,null,null,null,null,null,null,null,null,"Year 2",{"$f":"TCO_1!D31","v":18.292673805199012},{"$f":"TCO_1!D34","v":19.872676141200788},{"$f":"TCO_1!D37","v":21.581991441573482},{"$f":"TCO_1!D40","v":17.95784800259332},null,null,2,{"$f":"IF($C$5=AR12,AL12:AO12,)","v":0}]
[null,null,null,null,null,null,null,null,null,null,null,null,null,null,null,null,null,null,null,null,null,null,null,null,null,null,null,null,null,null,null,null,null,null,null,null,"Year 3",{"$f":"TCO_1!E31","v":14.755014980043331},{"$f":"TCO_1!E34","v":17.180011244826861},{"$f":"TCO_1!E37","v":18.46437240048941},{"$f":"TCO_1!E40","v":14.860581207929563},null,null,3,{"$f":"IF($C$5=AR13,AL13:AO13,)","v":0}]
[null,null,null,null,null,null,null,null,null,null,null,null,null,null,null,null,null,null,null,null,null,null,null,null,null,null,null,null,null,null,null,null,null,null,null,null,"Year 4",{"$f":"TCO_1!F31","v":12.850447621380949},{"$f":"TCO_1!F34","v":15.588472298122172},{"$f":"TCO_1!F37","v":16.65489814030791},{"$f":"TCO_1!F40","v":13.144058621913461},null,null,4,{"$f":"IF($C$5=AR14,AL14:AO14,)","v":0}]
[null,null,"INR",null,null,null,null,null,null,null,null,null,null,null,null,null,null,null,null,null,null,null,null,null,null,null,null,null,null,null,null,null,null,null,null,null,"Year 5",{"$f":"TCO_1!G31","v":11.609480535366913},{"$f":"TCO_1!G34","v":14.455542157174751},{"$f":"TCO_1!G37","v":15.38730001800676},{"$f":"TCO_1!G40","v":11.992457466837006},null,null,5,{"$f":"IF($C$5=AR15,AL15:AO15,)","v":11.609480535366913},14.455542157174751,15.38730001800676,11.992457466837006]
{"$rows_left_out":67}
{"sheet":"Sensitivity","index":2,"n_rows":21,"n_cols":7,"rows_kept":21,"cut":false,"hidden":true,"merged":[]}
[]
[null,"Vehicle Utilization",0.5,0.25,-0.25,-0.5]
[null,"e-LCFV",{"$f":"(C2*'LCFV TCO Dashboard'!$C$7)+'LCFV TCO Dashboard'!$C$7","v":225},{"$f":"(D2*'LCFV TCO Dashboard'!$C$7)+'LCFV TCO Dashboard'!$C$7","v":187.5},{"$f":"(E2*'LCFV TCO Dashboard'!$C$7)+'LCFV TCO Dashboard'!$C$7","v":112.5},{"$f":"(F2*'LCFV TCO Dashboard'!$C$7)+'LCFV TCO Dashboard'!$C$7","v":75}]
[null,"Petrol",{"$f":"C3","v":225},{"$f":"D3","v":187.5},112.5,75]
[null,"Diesel",{"$f":"C4","v":225},{"$f":"D4","v":187.5},{"$f":"E4","v":112.5},{"$f":"F4","v":75}]
[null,"CNG",225,187.5,112.5,75]
[]
[null,null,0.5,0.25,-0.25,-0.5,"TCO"]
[null,"e-LCFV",8.5299999999999994,10.11,16.45,24.36,12.49]
[null,"Petrol",10.66,11.94,17.07,23.48,13.87]
[null,"Diesel",11.78,13.15,18.64,25.51,15.21]
[null,"CNG",9.14,10.54,16.149999999999999,23.16,12.64]
[]
[]
[]
{"$rows_left_out":7}
{"sheet":"Summary","index":3,"n_rows":29,"n_cols":5,"rows_kept":29,"cut":false,"hidden":false,"merged":[[0,0,0,1],[10,0,10,4],[18,0,18,4],[26,0,26,4]]}
["TRAVEL DETAILS"]
["Number of Vehicle",1]
["Life of Vehicle (yrs)",10]
["Annual drive distance (KM)",{"$f":"'LCFV TCO Dashboard'!C10","v":47250}]
["Total Distance Travel (KM)",{"$f":"B3*B4","v":472500}]
["LIB Cost (USD/kWh)",{"$f":"'LCFV TCO Dashboard'!C40","v":137}]
["USD to INR",73]
["General Inputs","e-LCFV","Petrol - LCFV","Diesel - LCFV","CNG - LCFV"]
["Discount rate (%)",{"$f":"'LCFV TCO Dashboard'!C25","v":0.1},{"$f":"'LCFV TCO Dashboard'!D25","v":0.1},{"$f":"'LCFV TCO Dashboard'!E25","v":0.1},{"$f":"'LCFV TCO Dashboard'!F25","v":0.1}]
["Resale rate (%)",{"$f":"'LCFV TCO Dashboard'!C26","v":0.2},{"$f":"'LCFV TCO Dashboard'!D26","v":0.1},{"$f":"'LCFV TCO Dashboard'!E26","v":0.1},{"$f":"'LCFV TCO Dashboard'!F26","v":0.1}]
[]
["Capital Cost","e-LCFV","Petrol - LCFV","Diesel - LCFV","CNG - LCFV"]
["Total Vehicle Cost (₹)",{"$f":"'Capital Cost'!B8","v":924995.58020477544},{"$f":"'Capital Cost'!C8","v":640674.82823551167},{"$f":"'Capital Cost'!D8","v":764459.06833692896},{"$f":"'Capital Cost'!E8","v":814814.66656023602}]
["Resale Value (₹)",{"$f":"B13*B10","v":184999.11604095509},{"$f":"C13*C10","v":64067.482823551167},{"$f":"D13*D10","v":76445.906833692905},{"$f":"E13*E10","v":81481.466656023607}]
["Total Charging Infrastructure Cost (₹/Vehicle)",{"$f":"'LCFV TCO Dashboard'!C33/Summary!B2","v":372000},{"$f":"'Capital Cost'!C19/B2","v":0},{"$f":"'Capital Cost'!D19/B2","v":0},{"$f":"'Capital Cost'!E19/B2","v":0}]
{"$rows_left_out":15}
{"sheet":"Currency","index":4,"n_rows":55,"n_cols":12,"rows_kept":55,"cut":false,"hidden":true,"merged":[[1,1,1,3],[15,1,15,2],[15,4,15,5],[15,7,15,8],[15,10,15,11]]}
[]
[null,"CURRENCY CONVERSION"]
[]
[null,"USD","INR","Conversion"]
[null,1,73,{"$f":"B5*C5","v":73}]
[]
[null,"EURO","INR","Conversion"]
[null,1,82,{"$f":"B8*C8","v":82}]
[]
[]
[]
[]
[]
[]
[]
{"$rows_left_out":41}
{"sheet":"Capital Cost","index":5,"n_rows":42,"n_cols":5,"rows_kept":42,"cut":false,"hidden":true,"merged":[[48,0,48,4],[23,0,23,4],[28,0,28,4],[33,0,33,4],[38,0,38,4],[43,0,43,4]]}
["Vehicle Cost","e-LCFV","Petrol - LCFV","Diesel - LCFV","CNG - LCFV"]
["Purchase Cost (₹)",{"$f":"VLOOKUP('LCFV TCO Dashboard'!$C$15,'Capital Cost'!$A$25:$E$27,2,0)","v":775000},{"$f":"VLOOKUP('LCFV TCO Dashboard'!$C$15,'Capital Cost'!$A$25:$E$27,3,0)","v":441000},{"$f":"VLOOKUP('LCFV TCO Dashboard'!$C$15,'Capital Cost'!$A$25:$E$27,4,0)","v":529000},{"$f":"VLOOKUP('LCFV TCO Dashboard'!$C$15,'Capital Cost'!$A$25:$E$27,5,0)","v":565000}]
["Tax (₹)",{"$f":"VLOOKUP('LCFV TCO Dashboard'!$C$15,'Capital Cost'!$A$30:$E$32,2,0)","v":0},{"$f":"VLOOKUP('LCFV TCO Dashboard'!$C$15,'Capital Cost'!$A$30:$E$32,3,0)","v":31991},{"$f":"VLOOKUP('LCFV TCO Dashboard'!$C$15,'Capital Cost'!$A$30:$E$32,4,0)","v":31991},{"$f":"VLOOKUP('LCFV TCO Dashboard'!$C$15,'Capital Cost'!$A$30:$E$32,5,0)","v":32500}]
["Insurance (₹)",{"$f":"VLOOKUP('LCFV TCO Dashboard'!$C$15,'Capital Cost'!$A$35:$E$37,2,0)","v":15500},{"$f":"VLOOKUP('LCFV TCO Dashboard'!$C$15,'Capital Cost'!$A$35:$E$37,3,0)","v":11293},{"$f":"VLOOKUP('LCFV TCO Dashboard'!$C$15,'Capital Cost'!$A$35:$E$37,4,0)","v":15870},{"$f":"VLOOKUP('LCFV TCO Dashboard'!$C$15,'Capital Cost'!$A$35:$E$37,5,0)","v":16950}]
["Financing Component (₹)",{"$f":"Financing!B17","v":134495.58020477544},{"$f":"Financing!C17","v":156390.82823551167},{"$f":"Financing!D17","v":187598.06833692896},{"$f":"Financing!E17","v":200364.66656023602}]
["Total Financial Incentive (₹)",0,0,0,0]
["Misc. Cost (₹)",0,0,0,0]
["Total Vehicle Cost (₹)",{"$f":"((B2+B3+B4+B5+B7)-B6)","v":924995.58020477544},{"$f":"((C2+C3+C4+C5+C7)-C6)","v":640674.82823551167},{"$f":"((D2+D3+D4+D5+D7)-D6)","v":764459.06833692896},{"$f":"((E2+E3+E4+E5+E7)-E6)","v":814814.66656023602}]
[]
["Charging Infrastructure Cost","e-LCFV","Petrol - LCFV","Diesel - LCFV","CNG - LCFV"]
["No. of Slow Charger (SC)",1,0,0,0]
["Cost of SC per unit (₹)",310000,0,0,0]
["Total Cost of SC (₹)",{"$f":"B11*B12","v":310000},{"$f":"C11*C12","v":0},{"$f":"D11*D12","v":0},0]
["No. of Fast Charger (FC)",0,0,0,0]
["Cost of FC per unit (₹)",1500000,0,0,0]
{"$rows_left_out":28}
{"sheet":"Operational Cost","index":6,"n_rows":47,"n_cols":5,"rows_kept":47,"cut":false,"hidden":true,"merged":[[33,0,33,4],[38,0,38,4],[43,0,43,4]]}
["Staff cost","e-LCFV","Petrol - LCFV","Diesel - LCFV","CNG - LCFV"]
["Staff Cost (₹ / Month)",{"$f":"'LCFV TCO Dashboard'!C39","v":25000},{"$f":"'LCFV TCO Dashboard'!C39","v":25000},{"$f":"'LCFV TCO Dashboard'!C39","v":25000},{"$f":"'LCFV TCO Dashboard'!C39","v":25000}]
["Other Support staff cost (₹ / Month)",0,0,0,0]
["Total Annual Staff Cost (₹)",{"$f":"((B2+B3)*12)","v":300000},{"$f":"((C2+C3)*12)","v":300000},300000,300000]
["Per km Staff Cost",{"$f":"B4/Summary!$B$4","v":6.3492063492063489},{"$f":"C4/Summary!$B$4","v":6.3492063492063489},{"$f":"D4/Summary!$B$4","v":6.3492063492063489},{"$f":"E4/Summary!$B$4","v":6.3492063492063489}]
[]
["Average Fuel Cost","e-LCFV","Petrol - LCFV","Diesel - LCFV","CNG - LCFV"]
["Fuel cost (₹/kWh; ₹/L;  ₹/kg)",{"$f":"VLOOKUP('LCFV TCO Dashboard'!$C$15,'Operational Cost'!$A$45:$E$47,2,0)","v":6},{"$f":"VLOOKUP('LCFV TCO Dashboard'!$C$15,'Operational Cost'!$A$45:$E$47,3,0)","v":101},{"$f":"VLOOKUP('LCFV TCO Dashboard'!$C$15,'Operational Cost'!$A$45:$E$47,4,0)","v":89},{"$f":"VLOOKUP('LCFV TCO Dashboard'!$C$15,'Operational Cost'!$A$45:$E$47,5,0)","v":43}]
["Mileage (km/kWh; km/L; km/kg)",{"$f":"'LCFV TCO Dashboard'!C46","v":5},{"$f":"'LCFV TCO Dashboard'!D46","v":13},{"$f":"'LCFV TCO Dashboard'!E46","v":11},{"$f":"'LCFV TCO Dashboard'!F46","v":13}]
["Annual fuel consumption (kWh; L; kg)",{"$f":"Summary!B4/B9","v":9450},{"$f":"Summary!B4/C9","v":3634.6153846153848},{"$f":"Summary!B4/D9","v":4295.454545454545},{"$f":"Summary!$B$4/E9","v":3634.6153846153848}]
["Total Annual Fuel Cost ( ₹ )",{"$f":"(B10*B8)","v":56700},{"$f":"(C10*C8)","v":367096.15384615387},{"$f":"(D10*D8)","v":382295.45454545453},{"$f":"(E10*E8)","v":156288.46153846153}]
["Per km Fuel Cost",{"$f":"B11/Summary!$B$4","v":1.2},{"$f":"C11/Summary!$B$4","v":7.7692307692307701},{"$f":"D11/Summary!$B$4","v":8.0909090909090899},{"$f":"E11/Summary!$B$4","v":3.3076923076923075}]
[]
["Maintenance Cost","e-LCFV","Petrol - LCFV","Diesel - LCFV","CNG - LCFV"]
["Annual Maintenance Cost (₹)",{"$f":"VLOOKUP('LCFV TCO Dashboard'!$C$15,'Operational Cost'!$A$40:$E$42,2,0)","v":15017},{"$f":"VLOOKUP('LCFV TCO Dashboard'!$C$15,'Operational Cost'!$A$40:$E$42,3,0)","v":24726},{"$f":"VLOOKUP('LCFV TCO Dashboard'!$C$15,'Operational Cost'!$A$40:$E$42,4,0)","v":27200},{"$f":"VLOOKUP('LCFV TCO Dashboard'!$C$15,'Operational Cost'!$A$40:$E$42,5,0)","v":25200}]
{"$rows_left_out":33}
{"sheet":"Financing","index":7,"n_rows":24,"n_cols":5,"rows_kept":24,"cut":false,"hidden":true,"merged":[[20,0,20,4],[25,0,25,4]]}
["Vehicle Cost","e-LCFV","Petrol - LCFV","Diesel - LCFV","CNG - LCFV"]
["Total Cost of LCFV (₹)",{"$f":"'LCFV TCO Dashboard'!C20-'LCFV TCO Dashboard'!C23","v":535000},{"$f":"'LCFV TCO Dashboard'!D20","v":441000},{"$f":"'LCFV TCO Dashboard'!E20","v":529000},{"$f":"'LCFV TCO Dashboard'!F20","v":565000}]
["Share of Operator (%)",{"$f":"100%-B6","v":0.8},{"$f":"100%-C6","v":0.8},0.8,0.8]
["Share of Operator (₹)",{"$f":"B3*B2","v":428000},{"$f":"C3*C2","v":352800},{"$f":"D3*D2","v":423200},{"$f":"E3*E2","v":452000}]
["Processing  Fees",{"$f":"IF(B8=0,0,IF(B4*0.5%>500,B4*0.5%,500))","v":2140},{"$f":"IF(C8=0,0,IF(C4*0.5%>500,C4*0.5%,500))","v":1764},2116,2260]
["Equity %",{"$f":"'LCFV TCO Dashboard'!C31","v":0.2},{"$f":"'LCFV TCO Dashboard'!D31","v":0.2},{"$f":"'LCFV TCO Dashboard'!E31","v":0.2},{"$f":"'LCFV TCO Dashboard'!F31","v":0.2}]
["Equity (₹)",{"$f":"(B6*B2)","v":107000},{"$f":"(C6*C2)","v":88200},{"$f":"(D6*D2)","v":105800},{"$f":"(E6*E2)","v":113000}]
["Loan amount (₹)",{"$f":"B4","v":428000},{"$f":"C4","v":352800},{"$f":"D4","v":423200},{"$f":"E4","v":452000}]
["Interest rate (%)",{"$f":"'LCFV TCO Dashboard'!C30","v":0.08},{"$f":"'LCFV TCO Dashboard'!D30","v":0.11},{"$f":"'LCFV TCO Dashboard'!E30","v":0.11},{"$f":"'LCFV TCO Dashboard'!F30","v":0.11}]
["Term of payment (yrs)",{"$f":"'LCFV TCO Dashboard'!C29","v":7},{"$f":"'LCFV TCO Dashboard'!D29","v":7},{"$f":"'LCFV TCO Dashboard'!E29","v":7},{"$f":"'LCFV TCO Dashboard'!F29","v":7}]
["No of EMI (Yearly)",{"$f":"B10*12","v":84},{"$f":"C10*12","v":84},84,84]
["Monthly EMI Loan (Rs.)",{"$f":"((PMT(B9/12,B10*12,-B8))+(B5/B11))","v":6696.3759548187545},{"$f":"((PMT(C9/12,C10*12,-C8))+(C5/C11))","v":6061.795574232282},7271.4055754396313,7766.2460304790002]
["Total interest paid",{"$f":"(B12*B10*12)-B8","v":134495.58020477544},{"$f":"(C12*C10*12)-C8","v":156390.82823551167},187598.06833692896,200364.66656023602]
["Yearly Interest Paid",{"$f":"B13/B10","v":19213.65431496792},{"$f":"C13/C10","v":22341.54689078738},{"$f":"D13/D10","v":26799.72404813271},{"$f":"E13/E10","v":28623.52379431943}]
["EMI per KM (Rs.)",{"$f":"B14/Summary!B4","v":0.40663818656016765},{"$f":"C14/Summary!B4","v":0.47283697123359536},{"$f":"D14/Summary!B4","v":0.56718992694460757},{"$f":"E14/Summary!B4","v":0.60578886337183979}]
{"$rows_left_out":10}
{"sheet":"TCO_1","index":8,"n_rows":40,"n_cols":13,"rows_kept":40,"cut":false,"hidden":true,"merged":[]}
["Parameter","Unit","e-LCFV","Petrol - LCFV","Diesel - LCFV","CNG - LCFV"]
["Discount rate value","-",{"$f":"Summary!B9","v":0.1},{"$f":"Summary!C9","v":0.1},{"$f":"Summary!D9","v":0.1},{"$f":"Summary!E9","v":0.1}]
["Resale rate value","-",{"$f":"Summary!B10","v":0.2},{"$f":"Summary!C10","v":0.1},{"$f":"Summary!D10","v":0.1},{"$f":"Summary!E10","v":0.1}]
["Capital recovery factor (CRF)_N","-",{"$f":"C2*(1+C2)^Summary!B3","v":0.2593742460100002},{"$f":"D2*(1+D2)^Summary!B3","v":0.2593742460100002},{"$f":"E2*(1+E2)^Summary!B3","v":0.2593742460100002},{"$f":"F2*(1+F2)^Summary!B3","v":0.2593742460100002}]
["Capital recovery factor (CRF)_D","-",{"$f":"((1+C2)^Summary!B3)-1","v":1.5937424601000019},{"$f":"(1+D2)^Summary!B3-1","v":1.5937424601000019},{"$f":"(1+E2)^Summary!B3-1","v":1.5937424601000019},{"$f":"(1+F2)^Summary!B3-1","v":1.5937424601000019}]
["CRF","-",{"$f":"C4/C5","v":0.16274539488251155},{"$f":"D4/D5","v":0.16274539488251155},{"$f":"E4/E5","v":0.16274539488251155},{"$f":"F4/F5","v":0.16274539488251155}]
["Present value factor (PVF)","-",{"$f":"1/(1+C2)^10","v":0.38554328942953148},{"$f":"1/(1+D2)^Summary!B3","v":0.38554328942953148},{"$f":"1/(1+E2)^Summary!B3","v":0.38554328942953148},{"$f":"1/(1+F2)^Summary!B3","v":0.38554328942953148}]
["Residual value (RV)","₹",{"$f":"Summary!B13*C3","v":184999.11604095509},{"$f":"Summary!C13*D3","v":64067.482823551167},{"$f":"Summary!D13*E3","v":76445.906833692905},{"$f":"Summary!E13*F3","v":81481.466656023607}]
["Annual  Travel Distance","km",{"$f":"Summary!$B$4","v":47250},{"$f":"Summary!$B$4","v":47250},{"$f":"Summary!$B$4","v":47250},{"$f":"Summary!$B$4","v":47250}]
["Capex component","₹",{"$f":"((Summary!B18-(C8*C7))*C6)","v":160413.32050059031},{"$f":"(Summary!C18-(D8*D7))*D6","v":100246.93840358136},{"$f":"(Summary!D18-(E8*E7))*E6","v":119615.56433657864},{"$f":"(Summary!E18-(F8*F7))*F6","v":127494.7478644692}]
["TCO","₹/km",{"$f":"(C10+L22)/C9","v":8.5410743139367113},{"$f":"(D10+L23)/D9","v":11.118342928162228},{"$f":"(E10+L24)/E9","v":11.758091164048205},{"$f":"(F10+L25)/F9","v":8.9597579707730706}]
[]
["Opex / year"]
["Vehicle type","Unit",1,{"$f":"C14+1","v":2},3,4,5,6,7,8,9,10,"Total"]
["e-LCFV","₹",{"$f":"Summary!$B$26/(1+$C$2)^C14","v":359744.90909090906},{"$f":"Summary!$B$26/(1+$C$2)^D14","v":327040.82644628099},{"$f":"Summary!$B$26/(1+$C$2)^E14","v":297309.84222389176},{"$f":"Summary!$B$26/(1+$C$2)^F14","v":270281.67474899249},{"$f":"Summary!$B$26/(1+$C$2)^G14","v":245710.61340817498},{"$f":"Summary!$B$26/(1+$C$2)^H14","v":223373.28491652268},{"$f":"Summary!$B$26/(1+$C$2)^I14","v":203066.62265138421},{"$f":"Summary!$B$26/(1+$C$2)^J14","v":184606.02059216751},{"$f":"Summary!$B$26/(1+$C$2)^K14","v":167823.65508378862},{"$f":"Summary!$B$26/(1+$C$2)^L14","v":152566.95916708055},{"$f":"SUM(C15:L15)/Summary!B3","v":243152.4408329193}]
{"$rows_left_out":26}
{"sheet":"Plots","index":9,"n_rows":0,"n_cols":0,"rows_kept":0,"cut":false,"hidden":true,"merged":[]}